Quantcast

cygwin: installation in problem

classic Classic list List threaded Threaded
1 message Options
Reply | Threaded
Open this post in threaded view
|  
Report Content as Inappropriate

cygwin: installation in problem

ankur goyal

Hi,

While trying to install NS2.34 in cygwin 1.7 under windows, i am getting
below error.

/ns-allinone-2.34/tcl8.4.18/unix/tclUnixTime.c:1: warning: -fPIC ignored for
target (all code is position independent)
/ns-allinone-2.34/tcl8.4.18/unix/tclUnixTime.c: In function ‘TclpGetClicks’:
/ns-allinone-2.34/tcl8.4.18/unix/tclUnixTime.c:100: error: storage size of
‘tz’ isn’t known
/ns-allinone-2.34/tcl8.4.18/unix/tclUnixTime.c:100: warning: unused variable
‘tz’
/ns-allinone-2.34/tcl8.4.18/unix/tclUnixTime.c: In function ‘Tcl_GetTime’:
/ns-allinone-2.34/tcl8.4.18/unix/tclUnixTime.c:253: error: storage size of
‘tz’ isn’t known
/ns-allinone-2.34/tcl8.4.18/unix/tclUnixTime.c:253: warning: unused variable
‘tz’
make: *** [tclUnixTime.o] Error 1
tcl8.4.18 make failed! Exiting ...
For problems with Tcl/Tk see http://www.scriptics.com

Can anyone please help me to sort this problem.

Thanks,
Ankur
Loading...